Problème lors de la compilation du mod



  • J'ai travaillé sur mon Mod ce soir tout fonctionne correctement en test sur éclipse je commence donc a le compilé pour le mettre sur mon serveur quand un message d’erreur apparaît et je ne comprend pas d'ou viens le problème …

           at com.sun.tools.javac.jvm.Gen.genCond(Gen.java:822)
           at com.sun.tools.javac.jvm.Gen.visitBinary(Gen.java:2133)
           at com.sun.tools.javac.tree.JCTree$JCBinary.accept(JCTree.java:1785)
           at com.sun.tools.javac.jvm.Gen.genExpr(Gen.java:946)
           at com.sun.tools.javac.jvm.Gen.genCond(Gen.java:869)
           at com.sun.tools.javac.jvm.Gen.genCond(Gen.java:822)
           at com.sun.tools.javac.jvm.Gen.visitBinary(Gen.java:2133)
           at com.sun.tools.javac.tree.JCTree$JCBinary.accept(JCTree.java:1785)
           at com.sun.tools.javac.jvm.Gen.genExpr(Gen.java:946)
           at com.sun.tools.javac.jvm.Gen.genCond(Gen.java:869)
           at com.sun.tools.javac.jvm.Gen.genCond(Gen.java:822)
           at com.sun.tools.javac.jvm.Gen.visitBinary(Gen.java:2133)
           at com.sun.tools.javac.tree.JCTree$JCBinary.accept(JCTree.java:1785)
           at com.sun.tools.javac.jvm.Gen.genExpr(Gen.java:946)
           at com.sun.tools.javac.jvm.Gen.genCond(Gen.java:869)
           at com.sun.tools.javac.jvm.Gen.genCond(Gen.java:822)
           at com.sun.tools.javac.jvm.Gen.visitBinary(Gen.java:2133)
           at com.sun.tools.javac.tree.JCTree$JCBinary.accept(JCTree.java:1785)
           at com.sun.tools.javac.jvm.Gen.genExpr(Gen.java:946)
           at com.sun.tools.javac.jvm.Gen.genCond(Gen.java:869)
           at com.sun.tools.javac.jvm.Gen.genCond(Gen.java:822)
           at com.sun.tools.javac.jvm.Gen.visitBinary(Gen.java:2133)
           at com.sun.tools.javac.tree.JCTree$JCBinary.accept(JCTree.java:1785)
           at com.sun.tools.javac.jvm.Gen.genExpr(Gen.java:946)
           at com.sun.tools.javac.jvm.Gen.genCond(Gen.java:869)
           at com.sun.tools.javac.jvm.Gen.genCond(Gen.java:822)
           at com.sun.tools.javac.jvm.Gen.visitBinary(Gen.java:2133)
           at com.sun.tools.javac.tree.JCTree$JCBinary.accept(JCTree.java:1785)
           at com.sun.tools.javac.jvm.Gen.genExpr(Gen.java:946)
           at com.sun.tools.javac.jvm.Gen.genCond(Gen.java:869)
           at com.sun.tools.javac.jvm.Gen.genCond(Gen.java:822)
           at com.sun.tools.javac.jvm.Gen.visitBinary(Gen.java:2133)
           at com.sun.tools.javac.tree.JCTree$JCBinary.accept(JCTree.java:1785)
           at com.sun.tools.javac.jvm.Gen.genExpr(Gen.java:946)
           at com.sun.tools.javac.jvm.Gen.genCond(Gen.java:869)
           at com.sun.tools.javac.jvm.Gen.genCond(Gen.java:822)
           at com.sun.tools.javac.jvm.Gen.visitBinary(Gen.java:2133)
    :compileJava FAILED
    
    FAILURE: Build failed with an exception.
    
    * What went wrong:
    Execution failed for task ':compileJava'.
    > Compilation failed; see the compiler error output for details.
    
    * Try:
    Run with --stacktrace option to get the stack trace. Run with --info or --debug
    option to get more log output.
    
    BUILD FAILED
    
    Total time: 8.975 secs
    
    C:\Users\Antoine\Desktop\Modding 2>
    

    Je ne comprend pas d'ou viens le problème ...


  • Correcteurs

    Une erreur basique qui revient souvent ce sont des majuscules qui ne devraient pas exister. A vérifier


  • Administrateurs

    Visiblement la jvm a rencontré une boucle infini lors de la compilation. J'avais encore jamais vu ça.

    Faudrait trouver quelle partie de ton code ne compile pas.