Erreur "finished with non-zero exit value 1" avec gradle



  • Hey !
    J'essaye de configurer le dossier eclipse avec gradle mais j'ai une erreur lorsque j'utilise la commande gradlew setupDecompWorkspace :

    org.gradle.process.internal.ExecException: Process 'command 'C:\Program Files\Java\jdk1.8.0_144\bin\java.exe'' finished with non-zero exit value 1
    

    Voici les logs :

    #################################################
            ForgeGradle 2.3-SNAPSHOT-1a79a84        
     https://github.com/MinecraftForge/ForgeGradle  
    #################################################
                  Powered by MCP unknown              
                http://modcoderpack.com            
            by: Searge, ProfMobius, Fesh0r,        
            R4wk, ZeuX, IngisKahn, bspkrs          
    #################################################
    :deobfCompileDummyTask
    :deobfProvidedDummyTask
    :getVersionJson
    :extractUserdev UP-TO-DATE
    :extractDependencyATs SKIPPED
    :extractMcpData SKIPPED
    :extractMcpMappings SKIPPED
    :genSrgs SKIPPED
    :downloadClient SKIPPED
    :downloadServer SKIPPED
    :splitServerJar SKIPPED
    :mergeJars SKIPPED
    :deobfMcSRG SKIPPED
    :decompileMcException in thread "main" java.lang.OutOfMemoryError: GC overhead limit exceeded
    at java.util.HashMap.newNode(HashMap.java:1742)
    at java.util.HashMap.putVal(HashMap.java:641)
    at java.util.HashMap.putMapEntries(HashMap.java:514)
    at java.util.HashMap.putAll(HashMap.java:784)
    at org.jetbrains.java.decompiler.struct.StructMethod.<init>(StructMethod.java:81)
    at org.jetbrains.java.decompiler.struct.StructClass.<init>(StructClass.java:113)
    at org.jetbrains.java.decompiler.struct.StructClass.<init>(StructClass.java:72)
    at org.jetbrains.java.decompiler.struct.StructContext.addArchive(StructContext.java:159)
    at org.jetbrains.java.decompiler.struct.StructContext.addSpace(StructContext.java:100)
    at org.jetbrains.java.decompiler.struct.StructContext.addSpace(StructContext.java:78)
    at org.jetbrains.java.decompiler.main.Fernflower.addAllClasspath(Fernflower.java:119)
    at org.jetbrains.java.decompiler.main.Fernflower.<init>(Fernflower.java:47)
    at org.jetbrains.java.decompiler.main.decompiler.BaseDecompiler.<init>(BaseDecompiler.java:32)
    at net.minecraftforge.gradle.tasks.fernflower.FernFlowerInvoker.runFernFlower(FernFlowerInvoker.java:64)
    at net.minecraftforge.gradle.tasks.fernflower.FernFlowerInvoker.main(FernFlowerInvoker.java:41)
    Picked up _JAVA_OPTIONS: -Xmx512M
    FAILED
    
    FAILURE: Build failed with an exception.
    
    * What went wrong:
    Execution failed for task ':decompileMc'.
    > Process 'command 'C:\Program Files\Java\jdk1.8.0_144\bin\java.exe'' finished with non-zero exit value 1
    
    * Try:
    Run with –info or --debug option to get more log output.
    
    * Exception is:
    org.gradle.api.tasks.TaskExecutionException: Execution failed for task ':decompileMc'.
    at org.gradle.api.internal.tasks.execution.ExecuteActionsTaskExecuter.executeActions(ExecuteActionsTaskExecuter.java:69)
    at org.gradle.api.internal.tasks.execution.ExecuteActionsTaskExecuter.execute(ExecuteActionsTaskExecuter.java:46)
    at org.gradle.api.internal.tasks.execution.PostExecutionAnalysisTaskExecuter.execute(PostExecutionAnalysisTaskExecuter.java:35)
    at org.gradle.api.internal.tasks.execution.SkipUpToDateTaskExecuter.execute(SkipUpToDateTaskExecuter.java:66)
    at org.gradle.api.internal.tasks.execution.ValidatingTaskExecuter.execute(ValidatingTaskExecuter.java:58)
    at org.gradle.api.internal.tasks.execution.SkipEmptySourceFilesTaskExecuter.execute(SkipEmptySourceFilesTaskExecuter.java:52)
    at org.gradle.api.internal.tasks.execution.SkipTaskWithNoActionsExecuter.execute(SkipTaskWithNoActionsExecuter.java:52)
    at org.gradle.api.internal.tasks.execution.SkipOnlyIfTaskExecuter.execute(SkipOnlyIfTaskExecuter.java:53)
    at org.gradle.api.internal.tasks.execution.ExecuteAtMostOnceTaskExecuter.execute(ExecuteAtMostOnceTaskExecuter.java:43)
    at org.gradle.execution.taskgraph.DefaultTaskGraphExecuter$EventFiringTaskWorker.execute(DefaultTaskGraphExecuter.java:203)
    at org.gradle.execution.taskgraph.DefaultTaskGraphExecuter$EventFiringTaskWorker.execute(DefaultTaskGraphExecuter.java:185)
    at org.gradle.execution.taskgraph.AbstractTaskPlanExecutor$TaskExecutorWorker.processTask(AbstractTaskPlanExecutor.java:66)
    at org.gradle.execution.taskgraph.AbstractTaskPlanExecutor$TaskExecutorWorker.run(AbstractTaskPlanExecutor.java:50)
    at org.gradle.execution.taskgraph.DefaultTaskPlanExecutor.process(DefaultTaskPlanExecutor.java:25)
    at org.gradle.execution.taskgraph.DefaultTaskGraphExecuter.execute(DefaultTaskGraphExecuter.java:110)
    at org.gradle.execution.SelectedTaskExecutionAction.execute(SelectedTaskExecutionAction.java:37)
    at org.gradle.execution.DefaultBuildExecuter.execute(DefaultBuildExecuter.java:37)
    at org.gradle.execution.DefaultBuildExecuter.access$000(DefaultBuildExecuter.java:23)
    at org.gradle.execution.DefaultBuildExecuter$1.proceed(DefaultBuildExecuter.java:43)
    at org.gradle.execution.DryRunBuildExecutionAction.execute(DryRunBuildExecutionAction.java:32)
    at org.gradle.execution.DefaultBuildExecuter.execute(DefaultBuildExecuter.java:37)
    at org.gradle.execution.DefaultBuildExecuter.execute(DefaultBuildExecuter.java:30)
    at org.gradle.initialization.DefaultGradleLauncher$4.run(DefaultGradleLauncher.java:153)
    at org.gradle.internal.Factories$1.create(Factories.java:22)
    at org.gradle.internal.progress.DefaultBuildOperationExecutor.run(DefaultBuildOperationExecutor.java:91)
    at org.gradle.internal.progress.DefaultBuildOperationExecutor.run(DefaultBuildOperationExecutor.java:53)
    at org.gradle.initialization.DefaultGradleLauncher.doBuildStages(DefaultGradleLauncher.java:150)
    at org.gradle.initialization.DefaultGradleLauncher.access$200(DefaultGradleLauncher.java:32)
    at org.gradle.initialization.DefaultGradleLauncher$1.create(DefaultGradleLauncher.java:98)
    at org.gradle.initialization.DefaultGradleLauncher$1.create(DefaultGradleLauncher.java:92)
    at org.gradle.internal.progress.DefaultBuildOperationExecutor.run(DefaultBuildOperationExecutor.java:91)
    at org.gradle.internal.progress.DefaultBuildOperationExecutor.run(DefaultBuildOperationExecutor.java:63)
    at org.gradle.initialization.DefaultGradleLauncher.doBuild(DefaultGradleLauncher.java:92)
    at org.gradle.initialization.DefaultGradleLauncher.run(DefaultGradleLauncher.java:83)
    at org.gradle.launcher.exec.InProcessBuildActionExecuter$DefaultBuildController.run(InProcessBuildActionExecuter.java:99)
    at org.gradle.tooling.internal.provider.ExecuteBuildActionRunner.run(ExecuteBuildActionRunner.java:28)
    at org.gradle.launcher.exec.ChainingBuildActionRunner.run(ChainingBuildActionRunner.java:35)
    at org.gradle.launcher.exec.InProcessBuildActionExecuter.execute(InProcessBuildActionExecuter.java:48)
    at org.gradle.launcher.exec.InProcessBuildActionExecuter.execute(InProcessBuildActionExecuter.java:30)
    at org.gradle.launcher.exec.ContinuousBuildActionExecuter.execute(ContinuousBuildActionExecuter.java:81)
    at org.gradle.launcher.exec.ContinuousBuildActionExecuter.execute(ContinuousBuildActionExecuter.java:46)
    at org.gradle.launcher.daemon.server.exec.ExecuteBuild.doBuild(ExecuteBuild.java:52)
    at org.gradle.launcher.daemon.server.exec.BuildCommandOnly.execute(BuildCommandOnly.java:36)
    at org.gradle.launcher.daemon.server.api.DaemonCommandExecution.proceed(DaemonCommandExecution.java:120)
    at org.gradle.launcher.daemon.server.exec.WatchForDisconnection.execute(WatchForDisconnection.java:37)
    at org.gradle.launcher.daemon.server.api.DaemonCommandExecution.proceed(DaemonCommandExecution.java:120)
    at org.gradle.launcher.daemon.server.exec.ResetDeprecationLogger.execute(ResetDeprecationLogger.java:26)
    at org.gradle.launcher.daemon.server.api.DaemonCommandExecution.proceed(DaemonCommandExecution.java:120)
    at org.gradle.launcher.daemon.server.exec.RequestStopIfSingleUsedDaemon.execute(RequestStopIfSingleUsedDaemon.java:34)
    at org.gradle.launcher.daemon.server.api.DaemonCommandExecution.proceed(DaemonCommandExecution.java:120)
    at org.gradle.launcher.daemon.server.exec.ForwardClientInput$2.call(ForwardClientInput.java:74)
    at org.gradle.launcher.daemon.server.exec.ForwardClientInput$2.call(ForwardClientInput.java:72)
    at org.gradle.util.Swapper.swap(Swapper.java:38)
    at org.gradle.launcher.daemon.server.exec.ForwardClientInput.execute(ForwardClientInput.java:72)
    at org.gradle.launcher.daemon.server.api.DaemonCommandExecution.proceed(DaemonCommandExecution.java:120)
    at org.gradle.launcher.daemon.server.health.DaemonHealthTracker.execute(DaemonHealthTracker.java:40)
    at org.gradle.launcher.daemon.server.api.DaemonCommandExecution.proceed(DaemonCommandExecution.java:120)
    at org.gradle.launcher.daemon.server.exec.LogToClient.doBuild(LogToClient.java:60)
    at org.gradle.launcher.daemon.server.exec.BuildCommandOnly.execute(BuildCommandOnly.java:36)
    at org.gradle.launcher.daemon.server.api.DaemonCommandExecution.proceed(DaemonCommandExecution.java:120)
    at org.gradle.launcher.daemon.server.exec.EstablishBuildEnvironment.doBuild(EstablishBuildEnvironment.java:72)
    at org.gradle.launcher.daemon.server.exec.BuildCommandOnly.execute(BuildCommandOnly.java:36)
    at org.gradle.launcher.daemon.server.api.DaemonCommandExecution.proceed(DaemonCommandExecution.java:120)
    at org.gradle.launcher.daemon.server.health.HintGCAfterBuild.execute(HintGCAfterBuild.java:41)
    at org.gradle.launcher.daemon.server.api.DaemonCommandExecution.proceed(DaemonCommandExecution.java:120)
    at org.gradle.launcher.daemon.server.exec.StartBuildOrRespondWithBusy$1.run(StartBuildOrRespondWithBusy.java:50)
    at org.gradle.launcher.daemon.server.DaemonStateCoordinator$1.run(DaemonStateCoordinator.java:237)
    at org.gradle.internal.concurrent.ExecutorPolicy$CatchAndRecordFailures.onExecute(ExecutorPolicy.java:54)
    at org.gradle.internal.concurrent.StoppableExecutorImpl$1.run(StoppableExecutorImpl.java:40)
    Caused by: org.gradle.process.internal.ExecException: Process 'command 'C:\Program Files\Java\jdk1.8.0_144\bin\java.exe'' finished with non-zero exit value 1
    at org.gradle.process.internal.DefaultExecHandle$ExecResultImpl.assertNormalExitValue(DefaultExecHandle.java:367)
    at org.gradle.process.internal.DefaultJavaExecAction.execute(DefaultJavaExecAction.java:31)
    at org.gradle.api.internal.file.DefaultFileOperations.javaexec(DefaultFileOperations.java:170)
    at org.gradle.api.internal.project.AbstractProject.javaexec(AbstractProject.java:848)
    at net.minecraftforge.gradle.tasks.fernflower.ApplyFernFlowerTask.runForkedFernFlower(ApplyFernFlowerTask.java:131)
    at net.minecraftforge.gradle.tasks.fernflower.ApplyFernFlowerTask.runFernFlower(ApplyFernFlowerTask.java:103)
    at net.minecraftforge.gradle.tasks.fernflower.ApplyFernFlowerTask.applyFernFlower(ApplyFernFlowerTask.java:84)
    at org.gradle.internal.reflect.JavaMethod.invoke(JavaMethod.java:75)
    at org.gradle.api.internal.project.taskfactory.AnnotationProcessingTaskFactory$StandardTaskAction.doExecute(AnnotationProcessingTaskFactory.java:228)
    at org.gradle.api.internal.project.taskfactory.AnnotationProcessingTaskFactory$StandardTaskAction.execute(AnnotationProcessingTaskFactory.java:221)
    at org.gradle.api.internal.project.taskfactory.AnnotationProcessingTaskFactory$StandardTaskAction.execute(AnnotationProcessingTaskFactory.java:210)
    at org.gradle.api.internal.AbstractTask$TaskActionWrapper.execute(AbstractTask.java:621)
    at org.gradle.api.internal.AbstractTask$TaskActionWrapper.execute(AbstractTask.java:604)
    at org.gradle.api.internal.tasks.execution.ExecuteActionsTaskExecuter.executeAction(ExecuteActionsTaskExecuter.java:80)
    at org.gradle.api.internal.tasks.execution.ExecuteActionsTaskExecuter.executeActions(ExecuteActionsTaskExecuter.java:61)
    ... 68 more
    
    BUILD FAILED
    
    Total time: 42.978 secs
    
    

    Je suis sous Windows 7/ 64 bits avec JRE-JDK 1.8.0_144

    Merci d'avance de votre aide !


  • Administrateurs

    Salut,
    Dans tes variables d'environnements supprimes la variable _JAVA_OPTIONS, elle bloque ta ram sur 512mo.



  • Ça fonctionne à merveille ! Merci beaucoup ! 🙂