Problème compilation mod



  • salut, j'ai essayer de compiler mon mod en faisant gradlew buil et voila ce que sa me met dans l'invite de commande

    #################################################
             ForgeGradle 1.2-SNAPSHOT-fb514d3        
      https://github.com/MinecraftForge/ForgeGradle  
    #################################################
                   Powered by MCP unknown               
                 http://modcoderpack.com             
             by: Searge, ProfMobius, Fesh0r,         
             R4wk, ZeuX, IngisKahn, bspkrs           
    #################################################
    :compileApiJava UP-TO-DATE
    :processApiResources UP-TO-DATE
    :apiClasses UP-TO-DATE
    :sourceMainJava
    :compileJavawarning: [options] bootstrap class path not set in conjunction with -source 1.6
    C:\Users\vinc.lasserre5\Desktop\dossier serveur\programme\Mod Rhodium\build\sources\java\fr\vinvin40220\Rhodium\init\StructureGenMod.java:15: error: strings in switch are not supported in -source 1.6
            switch(string)
                  ^
      (use -source 7 or higher to enable strings in switch)
    Note: C:\Users\vinc.lasserre5\Desktop\dossier serveur\programme\Mod Rhodium\build\sources\java\fr\vinvin40220\Rhodium\items\ItemChestRadar.java uses unchecked or unsafe operations.
    Note: Recompile with -Xlint:unchecked for details.
    1 error
    1 warning
     FAILED
    
    FAILURE: Build failed with an exception.
    
    * What went wrong:
    Execution failed for task ':compileJava'.
    > Compilation failed; see the compiler error output for details.
    
    * Try:
    Run with --stacktrace option to get the stack trace. Run with --info or --debug option to get more log output.
    
    BUILD FAILED
    
    Total time: 19.801 secs
    

  • Administrateurs

    Bonsoir,

    Les demances concernant la programmation vont dans la section support pour les moddeurs.

    Ton mod ne compile pas car par défaut ta version compile pour Java 6 (je suppose que tu es en 1.7.10, du-coup j'ai ajouté ce prefixe de discussion) or tu utilises un switch sur un string, ce qui n'est que disponible à partir de Java 7.



  • il faur rajouter
    sourceCompatibility = '1.7'
    targetCompatibility = '1.7'
    j'ai vu çà mais je suis pas sur, peut tu me confirmer l'info



  • Yep



  • J'ai assayer en rajoutant sa mais même erreur



  • a non c'est pas la même erreur

    C:\Users\vinc.lasserre5\Desktop\dossier serveur\programme\Mod Rhodium>gradlew build
    #################################################
             ForgeGradle 1.2-SNAPSHOT-fb514d3
      https://github.com/MinecraftForge/ForgeGradle
    #################################################
                   Powered by MCP unknown
                 http://modcoderpack.com
             by: Searge, ProfMobius, Fesh0r,
             R4wk, ZeuX, IngisKahn, bspkrs
    #################################################
    :compileApiJava UP-TO-DATE
    :processApiResources UP-TO-DATE
    :apiClasses UP-TO-DATE
    :sourceMainJava UP-TO-DATE
    :compileJava UP-TO-DATE
    :processResources FAILED
    
    FAILURE: Build failed with an exception.
    
    * What went wrong:
    Execution failed for task ':processResources'.
    > Could not copy file 'C:\Users\vinc.lasserre5\Desktop\dossier serveur\programme\Mod Rhodium\src\main\resources\mcmod.info' to 'C:\Users\vinc.lasserre5\Desktop\dossier serveur\programme\Mod Rhodium\build\resources\main\mcmod.info'.
    
    * Try:
    Run with --stacktrace option to get the stack trace. Run with --info or --debug option to get more log output.
    
    BUILD FAILED
    
    Total time: 1 mins 47.631 secs
    


  • Tu dois réinstaller le MDK(Src) en compler



  • J'ai réinstaller JDK mais sa marque la même chose

    C:\Users\vinc.lasserre5\Desktop\dossier serveur\programme\Mod Rhodium>gradlew build
    #################################################
             ForgeGradle 1.2-SNAPSHOT-fb514d3
      https://github.com/MinecraftForge/ForgeGradle
    #################################################
                   Powered by MCP unknown
                 http://modcoderpack.com
             by: Searge, ProfMobius, Fesh0r,
             R4wk, ZeuX, IngisKahn, bspkrs
    #################################################
    :compileApiJava UP-TO-DATE
    :processApiResources UP-TO-DATE
    :apiClasses UP-TO-DATE
    :sourceMainJava UP-TO-DATE
    :compileJava
    Note: C:\Users\vinc.lasserre5\Desktop\dossier serveur\programme\Mod Rhodium\build\sources\java\fr\vinvin40220\Rhodium\items\ItemChestRadar.java uses unchecked or unsafe operations.
    Note: Recompile with -Xlint:unchecked for details.
    :processResources FAILED
    
    FAILURE: Build failed with an exception.
    
    * What went wrong:
    Execution failed for task ':processResources'.
    > Could not copy file 'C:\Users\vinc.lasserre5\Desktop\dossier serveur\programme\Mod Rhodium\src\main\resources\mcmod.info' to 'C:\Users\vinc.lasserre5\Desktop\dossier serveur\programme\Mod Rhodium\build\resources\main\mcmod.info'.
    
    * Try:
    Run with --stacktrace option to get the stack trace. Run with --info or --debug option to get more log output.
    
    BUILD FAILED
    
    Total time: 26.93 secs
    

  • Administrateurs

    Il n'arrive pas à copier le fichier mcmod.info.
    Essaies de supprimer le dossier build et de relancer la commande.



  • j'ai supprimer le dossier build mais sa me marque toujours la même erreur


  • Administrateurs

    Utilises la commande gradlew build --stacktrace et envoies le résultat, cela donnera plus d'info sur pourquoi il n'arrive pas à le copier.



  • JDK ou MDK/Src? Si c'est JDK j'ai dit le src sinon ecoutes robin



  • @robin4002
    gradlew build --stacktrace me donne ca et Daich j'ai pas trop comprit ton message

    C:\Users\vinc.lasserre5\Desktop\dossier serveur\programme\Mod Rhodium>gradlew build --stacktrace
    java.net.UnknownHostException: export.mcpbot.bspk.rs
            at java.net.AbstractPlainSocketImpl.connect(AbstractPlainSocketImpl.java:184)
            at java.net.PlainSocketImpl.connect(PlainSocketImpl.java:172)
            at java.net.SocksSocketImpl.connect(SocksSocketImpl.java:392)
            at java.net.Socket.connect(Socket.java:589)
            at java.net.Socket.connect(Socket.java:538)
            at sun.net.NetworkClient.doConnect(NetworkClient.java:180)
            at sun.net.www.http.HttpClient.openServer(HttpClient.java:463)
            at sun.net.www.http.HttpClient.openServer(HttpClient.java:558)
            at sun.net.www.http.HttpClient.<init>(HttpClient.java:242)
            at sun.net.www.http.HttpClient.New(HttpClient.java:339)
            at sun.net.www.http.HttpClient.New(HttpClient.java:357)
            at sun.net.www.protocol.http.HttpURLConnection.getNewHttpClient(HttpURLConnection.java:1220)
            at sun.net.www.protocol.http.HttpURLConnection.plainConnect0(HttpURLConnection.java:1156)
            at sun.net.www.protocol.http.HttpURLConnection.plainConnect(HttpURLConnection.java:1050)
            at sun.net.www.protocol.http.HttpURLConnection.connect(HttpURLConnection.java:984)
            at net.minecraftforge.gradle.common.BasePlugin.getWithEtag(BasePlugin.java:490)
            at net.minecraftforge.gradle.common.BasePlugin.setVersionInfoJson(BasePlugin.java:178)
            at net.minecraftforge.gradle.common.BasePlugin.apply(BasePlugin.java:119)
            at net.minecraftforge.gradle.common.BasePlugin.apply(BasePlugin.java:50)
            at org.gradle.api.internal.plugins.DefaultPluginContainer.providePlugin(DefaultPluginContainer.java:110)
            at org.gradle.api.internal.plugins.DefaultPluginContainer.addPluginInternal(DefaultPluginContainer.java:69)
            at org.gradle.api.internal.plugins.DefaultPluginContainer.apply(DefaultPluginContainer.java:35)
            at org.gradle.api.internal.plugins.DefaultObjectConfigurationAction.applyPlugin(DefaultObjectConfigurationAction.java:117)
            at org.gradle.api.internal.plugins.DefaultObjectConfigurationAction.access$200(DefaultObjectConfigurationAction.java:36)
            at org.gradle.api.internal.plugins.DefaultObjectConfigurationAction$3.run(DefaultObjectConfigurationAction.java:85)
            at org.gradle.api.internal.plugins.DefaultObjectConfigurationAction.execute(DefaultObjectConfigurationAction.java:130)
            at org.gradle.api.internal.project.AbstractPluginAware.apply(AbstractPluginAware.java:41)
            at org.gradle.api.Project$apply$0.call(Unknown Source)
            at org.codehaus.groovy.runtime.callsite.CallSiteArray.defaultCall(CallSiteArray.java:45)
            at org.codehaus.groovy.runtime.callsite.AbstractCallSite.call(AbstractCallSite.java:108)
            at org.codehaus.groovy.runtime.callsite.AbstractCallSite.call(AbstractCallSite.java:116)
            at org.gradle.api.internal.project.ProjectScript.apply(ProjectScript.groovy:34)
            at org.gradle.api.Script$apply$0.callCurrent(Unknown Source)
            at org.codehaus.groovy.runtime.callsite.CallSiteArray.defaultCallCurrent(CallSiteArray.java:49)
            at org.codehaus.groovy.runtime.callsite.AbstractCallSite.callCurrent(AbstractCallSite.java:133)
            at org.codehaus.groovy.runtime.callsite.AbstractCallSite.callCurrent(AbstractCallSite.java:141)
            at build_8nci6b3i8hiqbo2qjs6pg155a.run(C:\Users\vinc.lasserre5\Desktop\dossier serveur\programme\Mod Rhodium\build.gradle:18)
            at org.gradle.groovy.scripts.internal.DefaultScriptRunnerFactory$ScriptRunnerImpl.run(DefaultScriptRunnerFactory.java:52)
            at org.gradle.configuration.DefaultScriptPluginFactory$ScriptPluginImpl.apply(DefaultScriptPluginFactory.java:187)
            at org.gradle.configuration.project.BuildScriptProcessor.execute(BuildScriptProcessor.java:39)
            at org.gradle.configuration.project.BuildScriptProcessor.execute(BuildScriptProcessor.java:26)
            at org.gradle.configuration.project.ConfigureActionsProjectEvaluator.evaluate(ConfigureActionsProjectEvaluator.java:34)
            at org.gradle.configuration.project.LifecycleProjectEvaluator.evaluate(LifecycleProjectEvaluator.java:55)
            at org.gradle.api.internal.project.AbstractProject.evaluate(AbstractProject.java:470)
            at org.gradle.api.internal.project.AbstractProject.evaluate(AbstractProject.java:79)
            at org.gradle.configuration.DefaultBuildConfigurer.configure(DefaultBuildConfigurer.java:31)
            at org.gradle.initialization.DefaultGradleLauncher.doBuildStages(DefaultGradleLauncher.java:128)
            at org.gradle.initialization.DefaultGradleLauncher.doBuild(DefaultGradleLauncher.java:105)
            at org.gradle.initialization.DefaultGradleLauncher.run(DefaultGradleLauncher.java:85)
            at org.gradle.launcher.exec.InProcessBuildActionExecuter$DefaultBuildController.run(InProcessBuildActionExecuter.java:81)
            at org.gradle.launcher.cli.ExecuteBuildAction.run(ExecuteBuildAction.java:33)
            at org.gradle.launcher.cli.ExecuteBuildAction.run(ExecuteBuildAction.java:24)
            at org.gradle.launcher.exec.InProcessBuildActionExecuter.execute(InProcessBuildActionExecuter.java:39)
            at org.gradle.launcher.exec.InProcessBuildActionExecuter.execute(InProcessBuildActionExecuter.java:29)
            at org.gradle.launcher.cli.RunBuildAction.run(RunBuildAction.java:50)
            at org.gradle.internal.Actions$RunnableActionAdapter.execute(Actions.java:171)
            at org.gradle.launcher.cli.CommandLineActionFactory$ParseAndBuildAction.execute(CommandLineActionFactory.java:237)
            at org.gradle.launcher.cli.CommandLineActionFactory$ParseAndBuildAction.execute(CommandLineActionFactory.java:210)
            at org.gradle.launcher.cli.JavaRuntimeValidationAction.execute(JavaRuntimeValidationAction.java:35)
            at org.gradle.launcher.cli.JavaRuntimeValidationAction.execute(JavaRuntimeValidationAction.java:24)
            at org.gradle.launcher.cli.CommandLineActionFactory$WithLogging.execute(CommandLineActionFactory.java:206)
            at org.gradle.launcher.cli.CommandLineActionFactory$WithLogging.execute(CommandLineActionFactory.java:169)
            at org.gradle.launcher.cli.ExceptionReportingAction.execute(ExceptionReportingAction.java:33)
            at org.gradle.launcher.cli.ExceptionReportingAction.execute(ExceptionReportingAction.java:22)
            at org.gradle.launcher.Main.doAction(Main.java:33)
            at org.gradle.launcher.bootstrap.EntryPoint.run(EntryPoint.java:45)
            at sun.reflect.NativeMethodAccessorImpl.invoke0(Native Method)
            at sun.reflect.NativeMethodAccessorImpl.invoke(NativeMethodAccessorImpl.java:62)
            at sun.reflect.DelegatingMethodAccessorImpl.invoke(DelegatingMethodAccessorImpl.java:43)
            at java.lang.reflect.Method.invoke(Method.java:498)
            at org.gradle.launcher.bootstrap.ProcessBootstrap.runNoExit(ProcessBootstrap.java:54)
            at org.gradle.launcher.bootstrap.ProcessBootstrap.run(ProcessBootstrap.java:35)
            at org.gradle.launcher.GradleMain.main(GradleMain.java:23)
            at sun.reflect.NativeMethodAccessorImpl.invoke0(Native Method)
            at sun.reflect.NativeMethodAccessorImpl.invoke(NativeMethodAccessorImpl.java:62)
            at sun.reflect.DelegatingMethodAccessorImpl.invoke(DelegatingMethodAccessorImpl.java:43)
            at java.lang.reflect.Method.invoke(Method.java:498)
            at org.gradle.wrapper.BootstrapMainStarter.start(BootstrapMainStarter.java:30)
            at org.gradle.wrapper.WrapperExecutor.execute(WrapperExecutor.java:127)
            at org.gradle.wrapper.GradleWrapperMain.main(GradleWrapperMain.java:56)
    #################################################
             ForgeGradle 1.2-SNAPSHOT-fb514d3
      https://github.com/MinecraftForge/ForgeGradle
    #################################################
                   Powered by MCP unknown
                 http://modcoderpack.com
             by: Searge, ProfMobius, Fesh0r,
             R4wk, ZeuX, IngisKahn, bspkrs
    #################################################
    :compileApiJava UP-TO-DATE
    :processApiResources UP-TO-DATE
    :apiClasses UP-TO-DATE
    :sourceMainJava UP-TO-DATE
    :compileJava UP-TO-DATE
    :processResources FAILED
    
    FAILURE: Build failed with an exception.
    
    * What went wrong:
    Execution failed for task ':processResources'.
    > Could not copy file 'C:\Users\vinc.lasserre5\Desktop\dossier serveur\programme\Mod Rhodium\src\main\resources\mcmod.info' to 'C:\Users\vinc.lasserre5\Desktop\dossier serveur\programme\Mod Rhodium\build\resources\main\mcmod.info'.
    
    * Try:
    Run with --info or --debug option to get more log output.
    
    * Exception is:
    org.gradle.api.tasks.TaskExecutionException: Execution failed for task ':processResources'.
            at org.gradle.api.internal.tasks.execution.ExecuteActionsTaskExecuter.executeActions(ExecuteActionsTaskExecuter.java:69)
            at org.gradle.api.internal.tasks.execution.ExecuteActionsTaskExecuter.execute(ExecuteActionsTaskExecuter.java:46)
            at org.gradle.api.internal.tasks.execution.PostExecutionAnalysisTaskExecuter.execute(PostExecutionAnalysisTaskExecuter.java:35)
            at org.gradle.api.internal.tasks.execution.SkipUpToDateTaskExecuter.execute(SkipUpToDateTaskExecuter.java:64)
            at org.gradle.api.internal.tasks.execution.ValidatingTaskExecuter.execute(ValidatingTaskExecuter.java:58)
            at org.gradle.api.internal.tasks.execution.SkipEmptySourceFilesTaskExecuter.execute(SkipEmptySourceFilesTaskExecuter.java:42)
            at org.gradle.api.internal.tasks.execution.SkipTaskWithNoActionsExecuter.execute(SkipTaskWithNoActionsExecuter.java:52)
            at org.gradle.api.internal.tasks.execution.SkipOnlyIfTaskExecuter.execute(SkipOnlyIfTaskExecuter.java:53)
            at org.gradle.api.internal.tasks.execution.ExecuteAtMostOnceTaskExecuter.execute(ExecuteAtMostOnceTaskExecuter.java:43)
            at org.gradle.api.internal.AbstractTask.executeWithoutThrowingTaskFailure(AbstractTask.java:296)
            at org.gradle.execution.taskgraph.AbstractTaskPlanExecutor$TaskExecutorWorker.executeTask(AbstractTaskPlanExecutor.java:79)
            at org.gradle.execution.taskgraph.AbstractTaskPlanExecutor$TaskExecutorWorker.processTask(AbstractTaskPlanExecutor.java:63)
            at org.gradle.execution.taskgraph.AbstractTaskPlanExecutor$TaskExecutorWorker.run(AbstractTaskPlanExecutor.java:51)
            at org.gradle.execution.taskgraph.DefaultTaskPlanExecutor.process(DefaultTaskPlanExecutor.java:23)
            at org.gradle.execution.taskgraph.DefaultTaskGraphExecuter.execute(DefaultTaskGraphExecuter.java:86)
            at org.gradle.execution.SelectedTaskExecutionAction.execute(SelectedTaskExecutionAction.java:29)
            at org.gradle.execution.DefaultBuildExecuter.execute(DefaultBuildExecuter.java:61)
            at org.gradle.execution.DefaultBuildExecuter.access$200(DefaultBuildExecuter.java:23)
            at org.gradle.execution.DefaultBuildExecuter$2.proceed(DefaultBuildExecuter.java:67)
            at org.gradle.execution.DryRunBuildExecutionAction.execute(DryRunBuildExecutionAction.java:32)
            at org.gradle.execution.DefaultBuildExecuter.execute(DefaultBuildExecuter.java:61)
            at org.gradle.execution.DefaultBuildExecuter.execute(DefaultBuildExecuter.java:54)
            at org.gradle.initialization.DefaultGradleLauncher.doBuildStages(DefaultGradleLauncher.java:148)
            at org.gradle.initialization.DefaultGradleLauncher.doBuild(DefaultGradleLauncher.java:105)
            at org.gradle.initialization.DefaultGradleLauncher.run(DefaultGradleLauncher.java:85)
            at org.gradle.launcher.exec.InProcessBuildActionExecuter$DefaultBuildController.run(InProcessBuildActionExecuter.java:81)
            at org.gradle.launcher.cli.ExecuteBuildAction.run(ExecuteBuildAction.java:33)
            at org.gradle.launcher.cli.ExecuteBuildAction.run(ExecuteBuildAction.java:24)
            at org.gradle.launcher.exec.InProcessBuildActionExecuter.execute(InProcessBuildActionExecuter.java:39)
            at org.gradle.launcher.exec.InProcessBuildActionExecuter.execute(InProcessBuildActionExecuter.java:29)
            at org.gradle.launcher.cli.RunBuildAction.run(RunBuildAction.java:50)
            at org.gradle.internal.Actions$RunnableActionAdapter.execute(Actions.java:171)
            at org.gradle.launcher.cli.CommandLineActionFactory$ParseAndBuildAction.execute(CommandLineActionFactory.java:237)
            at org.gradle.launcher.cli.CommandLineActionFactory$ParseAndBuildAction.execute(CommandLineActionFactory.java:210)
            at org.gradle.launcher.cli.JavaRuntimeValidationAction.execute(JavaRuntimeValidationAction.java:35)
            at org.gradle.launcher.cli.JavaRuntimeValidationAction.execute(JavaRuntimeValidationAction.java:24)
            at org.gradle.launcher.cli.CommandLineActionFactory$WithLogging.execute(CommandLineActionFactory.java:206)
            at org.gradle.launcher.cli.CommandLineActionFactory$WithLogging.execute(CommandLineActionFactory.java:169)
            at org.gradle.launcher.cli.ExceptionReportingAction.execute(ExceptionReportingAction.java:33)
            at org.gradle.launcher.cli.ExceptionReportingAction.execute(ExceptionReportingAction.java:22)
            at org.gradle.launcher.Main.doAction(Main.java:33)
            at org.gradle.launcher.bootstrap.EntryPoint.run(EntryPoint.java:45)
            at org.gradle.launcher.bootstrap.ProcessBootstrap.runNoExit(ProcessBootstrap.java:54)
            at org.gradle.launcher.bootstrap.ProcessBootstrap.run(ProcessBootstrap.java:35)
            at org.gradle.launcher.GradleMain.main(GradleMain.java:23)
            at org.gradle.wrapper.BootstrapMainStarter.start(BootstrapMainStarter.java:30)
            at org.gradle.wrapper.WrapperExecutor.execute(WrapperExecutor.java:127)
            at org.gradle.wrapper.GradleWrapperMain.main(GradleWrapperMain.java:56)
    Caused by: org.gradle.api.GradleException: Could not copy file 'C:\Users\vinc.lasserre5\Desktop\dossier serveur\programme\Mod Rhodium\src\main\resources\mcmod.info' to 'C:\Users\vinc.lasserre5\Desktop\dossier serveur\programme\Mod Rhodium\build\resources\main\mcmod.info'.
            at org.gradle.api.internal.file.AbstractFileTreeElement.copyTo(AbstractFileTreeElement.java:79)
            at org.gradle.api.internal.file.copy.DefaultFileCopyDetails.copyTo(DefaultFileCopyDetails.java:102)
            at org.gradle.api.internal.file.copy.FileCopyAction$FileCopyDetailsInternalAction.processFile(FileCopyAction.java:44)
            at org.gradle.api.internal.file.copy.NormalizingCopyActionDecorator$1$1.processFile(NormalizingCopyActionDecorator.java:65)
            at org.gradle.api.internal.file.copy.DuplicateHandlingCopyActionDecorator$1$1.processFile(DuplicateHandlingCopyActionDecorator.java:60)
            at org.gradle.api.internal.file.copy.CopyFileVisitorImpl.processFile(CopyFileVisitorImpl.java:60)
            at org.gradle.api.internal.file.copy.CopyFileVisitorImpl.visitFile(CopyFileVisitorImpl.java:44)
            at org.gradle.api.internal.file.collections.DirectoryFileTree.walkDir(DirectoryFileTree.java:157)
            at org.gradle.api.internal.file.collections.DirectoryFileTree.visitFrom(DirectoryFileTree.java:125)
            at org.gradle.api.internal.file.collections.DirectoryFileTree.visit(DirectoryFileTree.java:115)
            at org.gradle.api.internal.file.collections.FileTreeAdapter.visit(FileTreeAdapter.java:96)
            at org.gradle.api.internal.file.CompositeFileTree.visit(CompositeFileTree.java:54)
            at org.gradle.api.internal.file.copy.CopySpecActionImpl.execute(CopySpecActionImpl.java:37)
            at org.gradle.api.internal.file.copy.CopySpecActionImpl.execute(CopySpecActionImpl.java:24)
            at org.gradle.api.internal.file.copy.DefaultCopySpec$DefaultCopySpecResolver.walk(DefaultCopySpec.java:498)
            at org.gradle.api.internal.file.copy.DefaultCopySpec$DefaultCopySpecResolver.walk(DefaultCopySpec.java:500)
            at org.gradle.api.internal.file.copy.DefaultCopySpec$DefaultCopySpecResolver.walk(DefaultCopySpec.java:500)
            at org.gradle.api.internal.file.copy.DefaultCopySpec.walk(DefaultCopySpec.java:322)
            at org.gradle.api.internal.file.copy.DelegatingCopySpecInternal.walk(DelegatingCopySpecInternal.java:206)
            at org.gradle.api.internal.file.copy.CopySpecBackedCopyActionProcessingStream.process(CopySpecBackedCopyActionProcessingStream.java:36)
            at org.gradle.api.internal.file.copy.DuplicateHandlingCopyActionDecorator$1.process(DuplicateHandlingCopyActionDecorator.java:44)
            at org.gradle.api.internal.file.copy.NormalizingCopyActionDecorator$1.process(NormalizingCopyActionDecorator.java:56)
            at org.gradle.api.internal.file.copy.FileCopyAction.execute(FileCopyAction.java:35)
            at org.gradle.api.internal.file.copy.NormalizingCopyActionDecorator.execute(NormalizingCopyActionDecorator.java:52)
            at org.gradle.api.internal.file.copy.DuplicateHandlingCopyActionDecorator.execute(DuplicateHandlingCopyActionDecorator.java:42)
            at org.gradle.api.internal.file.copy.CopyActionExecuter.execute(CopyActionExecuter.java:38)
            at org.gradle.api.tasks.AbstractCopyTask.copy(AbstractCopyTask.java:83)
            at org.gradle.language.jvm.tasks.ProcessResources.copy(ProcessResources.java:33)
            at org.gradle.internal.reflect.JavaMethod.invoke(JavaMethod.java:63)
            at org.gradle.api.internal.project.taskfactory.AnnotationProcessingTaskFactory$StandardTaskAction.doExecute(AnnotationProcessingTaskFactory.java:218)
            at org.gradle.api.internal.project.taskfactory.AnnotationProcessingTaskFactory$StandardTaskAction.execute(AnnotationProcessingTaskFactory.java:211)
            at org.gradle.api.internal.project.taskfactory.AnnotationProcessingTaskFactory$StandardTaskAction.execute(AnnotationProcessingTaskFactory.java:200)
            at org.gradle.api.internal.AbstractTask$TaskActionWrapper.execute(AbstractTask.java:570)
            at org.gradle.api.internal.AbstractTask$TaskActionWrapper.execute(AbstractTask.java:553)
            at org.gradle.api.internal.tasks.execution.ExecuteActionsTaskExecuter.executeAction(ExecuteActionsTaskExecuter.java:80)
            at org.gradle.api.internal.tasks.execution.ExecuteActionsTaskExecuter.executeActions(ExecuteActionsTaskExecuter.java:61)
            ... 47 more
    Caused by: groovy.lang.GroovyRuntimeException: Failed to parse template script (your template may contain an error or be trying to use expressions not currently supported): startup failed:
    SimpleTemplateScript1.groovy: 6: unexpected token: 0 @ line 6, column 24.
         \"version\": \"${1.0.0}\",
                              ^
    
    1 error
    
            at org.gradle.api.internal.file.copy.FilterChain$3.transform(FilterChain.java:90)
            at org.gradle.api.internal.file.copy.FilterChain$3.transform(FilterChain.java:84)
            at org.gradle.api.internal.ChainingTransformer.transform(ChainingTransformer.java:37)
            at org.gradle.api.internal.file.copy.FilterChain.transform(FilterChain.java:39)
            at org.gradle.api.internal.file.copy.FilterChain.transform(FilterChain.java:46)
            at org.gradle.api.internal.file.copy.DefaultFileCopyDetails.open(DefaultFileCopyDetails.java:86)
            at org.gradle.api.internal.file.AbstractFileTreeElement.copyTo(AbstractFileTreeElement.java:56)
            at org.gradle.api.internal.file.copy.DefaultFileCopyDetails.copyTo(DefaultFileCopyDetails.java:94)
            at org.gradle.api.internal.file.AbstractFileTreeElement.copyFile(AbstractFileTreeElement.java:93)
            at org.gradle.api.internal.file.AbstractFileTreeElement.copyTo(AbstractFileTreeElement.java:74)
            ... 82 more
    
    
    BUILD FAILED
    
    Total time: 37.789 secs
    

  • Administrateurs

    @vinvin40220 a dit dans Problème compilation mod :

    "version": "${1.0.0}",

    Alors soit tu mets "${version}" comme valeur (c'est le cas par défaut) et dans ce cas c'est remplacé automatiquement par la version qui se trouve dans build.gradle, soit tu mets "1.0.0", mais le mélange des deux comme tu as actuellement, ça ne peut pas fonctionner (car il va essayer de remplacer par la valeur de la variable 1.0.0, qui n'existe pas).



  • j'ai mis "1.0.0" mais sa ne change rien, ily a toujours un problème quand je compile


  • Administrateurs

    C'est toujours exactement le même message ?
    Il n'y aurait pas le même soucis mais avec mcversion par hasard ?



  • JDK c'esr TOUT le java DEV MDK c'est les sources le fichier.zip que tu installe chez Forge.Si c'est le jdk que tu reinstalle fallait le Src sinon...



  • C'est à dire le même souci avec mcversion ? et oui c'est le même message


  • Administrateurs

    Envoies ton fichier mcmod.info complet.



  • [
    {
      "modid": "rhodium",
      "name": "Rhodium",
      "description": "Create by vinvin40220",
      "version": "${1.0.0}",
      "mcversion": "${mcversion}",
      "url": "",
      "updateUrl": "",
      "authorList": ["ExampleDude"],
      "credits": "The Forge and FML guys, for making this example",
      "logoFile": "",
      "screenshots": [],
      "dependencies": []
    }
    ]
    

Log in to reply