Gradelew ne marche plus du tout



  • Bonjour, mon problème est je suppose très gros, car il s'agit du fait que gradlew ne marche plus du tout. Même le "gradlew task" ne marche plus. L'erreure:

    
    FAILURE: Build failed with an exception.
    
    * Where:
    Build file 'C:\Users\Aurelien\Desktop\alesiummod\build.gradle' line: 18
    
    * What went wrong:
    A problem occurred evaluating root project 'alesiummod'.
    > com.google.gson.stream.MalformedJsonException: Unterminated string at line 88780 column 12
    
    * Try:
    Run with --info or --debug option to get more log output.
    
    * Exception is:
    org.gradle.api.GradleScriptException: A problem occurred evaluating root project 'alesiummod'.
    	at org.gradle.groovy.scripts.internal.DefaultScriptRunnerFactory$ScriptRunnerImpl.run(DefaultScriptRunnerFactory.java:54)
    	at org.gradle.configuration.DefaultScriptPluginFactory$ScriptPluginImpl.apply(DefaultScriptPluginFactory.java:187)
    	at org.gradle.configuration.project.BuildScriptProcessor.execute(BuildScriptProcessor.java:39)
    	at org.gradle.configuration.project.BuildScriptProcessor.execute(BuildScriptProcessor.java:26)
    	at org.gradle.configuration.project.ConfigureActionsProjectEvaluator.evaluate(ConfigureActionsProjectEvaluator.java:34)
    	at org.gradle.configuration.project.LifecycleProjectEvaluator.evaluate(LifecycleProjectEvaluator.java:55)
    	at org.gradle.api.internal.project.AbstractProject.evaluate(AbstractProject.java:470)
    	at org.gradle.api.internal.project.AbstractProject.evaluate(AbstractProject.java:79)
    	at org.gradle.configuration.DefaultBuildConfigurer.configure(DefaultBuildConfigurer.java:31)
    	at org.gradle.initialization.DefaultGradleLauncher.doBuildStages(DefaultGradleLauncher.java:128)
    	at org.gradle.initialization.DefaultGradleLauncher.doBuild(DefaultGradleLauncher.java:105)
    	at org.gradle.initialization.DefaultGradleLauncher.run(DefaultGradleLauncher.java:85)
    	at org.gradle.launcher.exec.InProcessBuildActionExecuter$DefaultBuildController.run(InProcessBuildActionExecuter.java:81)
    	at org.gradle.launcher.cli.ExecuteBuildAction.run(ExecuteBuildAction.java:33)
    	at org.gradle.launcher.cli.ExecuteBuildAction.run(ExecuteBuildAction.java:24)
    	at org.gradle.launcher.exec.InProcessBuildActionExecuter.execute(InProcessBuildActionExecuter.java:39)
    	at org.gradle.launcher.exec.InProcessBuildActionExecuter.execute(InProcessBuildActionExecuter.java:29)
    	at org.gradle.launcher.cli.RunBuildAction.run(RunBuildAction.java:50)
    	at org.gradle.internal.Actions$RunnableActionAdapter.execute(Actions.java:171)
    	at org.gradle.launcher.cli.CommandLineActionFactory$ParseAndBuildAction.execute(CommandLineActionFactory.java:237)
    	at org.gradle.launcher.cli.CommandLineActionFactory$ParseAndBuildAction.execute(CommandLineActionFactory.java:210)
    	at org.gradle.launcher.cli.JavaRuntimeValidationAction.execute(JavaRuntimeValidationAction.java:35)
    	at org.gradle.launcher.cli.JavaRuntimeValidationAction.execute(JavaRuntimeValidationAction.java:24)
    	at org.gradle.launcher.cli.CommandLineActionFactory$WithLogging.execute(CommandLineActionFactory.java:206)
    	at org.gradle.launcher.cli.CommandLineActionFactory$WithLogging.execute(CommandLineActionFactory.java:169)
    	at org.gradle.launcher.cli.ExceptionReportingAction.execute(ExceptionReportingAction.java:33)
    	at org.gradle.launcher.cli.ExceptionReportingAction.execute(ExceptionReportingAction.java:22)
    	at org.gradle.launcher.Main.doAction(Main.java:33)
    	at org.gradle.launcher.bootstrap.EntryPoint.run(EntryPoint.java:45)
    	at org.gradle.launcher.bootstrap.ProcessBootstrap.runNoExit(ProcessBootstrap.java:54)
    	at org.gradle.launcher.bootstrap.ProcessBootstrap.run(ProcessBootstrap.java:35)
    	at org.gradle.launcher.GradleMain.main(GradleMain.java:23)
    	at org.gradle.wrapper.BootstrapMainStarter.start(BootstrapMainStarter.java:30)
    	at org.gradle.wrapper.WrapperExecutor.execute(WrapperExecutor.java:127)
    	at org.gradle.wrapper.GradleWrapperMain.main(GradleWrapperMain.java:56)
    Caused by: com.google.gson.JsonSyntaxException: com.google.gson.stream.MalformedJsonException: Unterminated string at line 88780 column 12
    	at com.google.gson.Gson.fromJson(Gson.java:818)
    	at com.google.gson.Gson.fromJson(Gson.java:768)
    	at com.google.gson.Gson.fromJson(Gson.java:717)
    	at com.google.gson.Gson.fromJson(Gson.java:689)
    	at net.minecraftforge.gradle.user.patch.UserPatchBasePlugin.setVersionInfoJson(UserPatchBasePlugin.java:145)
    	at net.minecraftforge.gradle.user.patch.UserPatchBasePlugin.applyPlugin(UserPatchBasePlugin.java:46)
    	at net.minecraftforge.gradle.common.BasePlugin.apply(BasePlugin.java:154)
    	at net.minecraftforge.gradle.common.BasePlugin.apply(BasePlugin.java:49)
    	at org.gradle.api.internal.plugins.DefaultPluginContainer.providePlugin(DefaultPluginContainer.java:110)
    	at org.gradle.api.internal.plugins.DefaultPluginContainer.addPluginInternal(DefaultPluginContainer.java:69)
    	at org.gradle.api.internal.plugins.DefaultPluginContainer.apply(DefaultPluginContainer.java:35)
    	at org.gradle.api.internal.plugins.DefaultObjectConfigurationAction.applyPlugin(DefaultObjectConfigurationAction.java:117)
    	at org.gradle.api.internal.plugins.DefaultObjectConfigurationAction.access$200(DefaultObjectConfigurationAction.java:36)
    	at org.gradle.api.internal.plugins.DefaultObjectConfigurationAction$3.run(DefaultObjectConfigurationAction.java:85)
    	at org.gradle.api.internal.plugins.DefaultObjectConfigurationAction.execute(DefaultObjectConfigurationAction.java:130)
    	at org.gradle.api.internal.project.AbstractPluginAware.apply(AbstractPluginAware.java:41)
    	at org.gradle.api.Project$apply$0.call(Unknown Source)
    	at org.gradle.api.internal.project.ProjectScript.apply(ProjectScript.groovy:34)
    	at org.gradle.api.Script$apply$0.callCurrent(Unknown Source)
    	at build_1ethdvnn5ct4i4sgk0iauqd0cd.run(C:\Users\Aurelien\Desktop\alesiummod\build.gradle:18)
    	at org.gradle.groovy.scripts.internal.DefaultScriptRunnerFactory$ScriptRunnerImpl.run(DefaultScriptRunnerFactory.java:52)
    	... 34 more
    Caused by: com.google.gson.stream.MalformedJsonException: Unterminated string at line 88780 column 12
    	at com.google.gson.stream.JsonReader.syntaxError(JsonReader.java:1505)
    	at com.google.gson.stream.JsonReader.skipQuotedValue(JsonReader.java:1100)
    	at com.google.gson.stream.JsonReader.skipValue(JsonReader.java:1229)
    	at com.google.gson.internal.bind.ReflectiveTypeAdapterFactory$Adapter.read(ReflectiveTypeAdapterFactory.java:170)
    	at com.google.gson.internal.bind.TypeAdapterRuntimeTypeWrapper.read(TypeAdapterRuntimeTypeWrapper.java:40)
    	at com.google.gson.internal.bind.MapTypeAdapterFactory$Adapter.read(MapTypeAdapterFactory.java:187)
    	at com.google.gson.internal.bind.MapTypeAdapterFactory$Adapter.read(MapTypeAdapterFactory.java:145)
    	at com.google.gson.internal.bind.ReflectiveTypeAdapterFactory$1.read(ReflectiveTypeAdapterFactory.java:93)
    	at com.google.gson.internal.bind.ReflectiveTypeAdapterFactory$Adapter.read(ReflectiveTypeAdapterFactory.java:172)
    	at com.google.gson.Gson.fromJson(Gson.java:803)
    	... 54 more
    
    
    BUILD FAILED
    
    Total time: 19.086 secs
    
    

    Sur cette ligne 18 on retrouve la ligne
    apply plugin: 'forge'.

    Si quelqu'un peut m'aider je le remercie !


  • Moddeurs confirmés Rédacteurs Administrateurs

    Salut,
    Il y a visiblement un json corrompu quelque part, supprimes le dossier de cache de gradle (dossier .gradle dans le dossier de ta session) et essaies à nouveau.



  • ça a juste marché. Merci beaucoup. Je sais pas comment c'est possible étant donné que le .gradle est livré avec forge et que je n'y est pas touché mais merci quand même !


Log in to reply